{"text_format":"1","workbook":"xlsx","n_sheets":4,"sheets":["Ergebnis","IS","Code","Graphik"],"not_rendered":{"charts":3,"images":0,"macros":1,"external_links":0,"defined_names":0,"comments":0,"pivot_tables":0},"unopened":[],"bounds":{"document_bytes":16777216,"sheet_cells":100000,"rows_first":2000,"rows_last":500,"rows_between":2000,"halvings":0,"cell_chars":16384,"cell_head_chars":4096},"cells_cut":0,"cells_raw":0,"read":"whole","date_system":"1900"}

{"sheet":"Ergebnis","index":0,"n_rows":74,"n_cols":30,"rows_kept":74,"cut":false,"hidden":false,"merged":[[1,27,1,33],[19,27,22,34],[3,2,4,4],[3,26,3,27],[2,23,4,23],[2,18,4,18],[2,20,4,20],[3,9,4,14],[3,16,4,16],[16,27,17,34]]}
[null,"  ","  ","  ","  ","  ","  ","  ","  ","  ","  ","  ","  ","  ","  ","  ","  ","  ","  ","  ","  ","  ","  ","  ","  ","  ","  ","  ","  ","  "]
[null,"  ","  ","  ","  ","  ","  ","  ","  ","  ","  ","  ","  ","  ","  ","  ","  ","  ","  ","  ","  ","  ","  ","  ",null,null,null,"Das Programm wird mit ''strg+k'' gestartet"]
[null,"  ",1,2,3,"  ","  ","  ","  ",1,2,3,4,5,6,"  ","  ","  ",{"$f":"Code!E6","v":"Kasami-Code 5"},"  ",{"$f":"Code!E7","v":"Kasami-Code 4"},"  ","  ",{"$f":"Code!E10","v":"KKF Codes 5 / 4"},"  ","  ","  ","  ","  ","  "]
[null,"  ",{"$f":"Code!E2","v":"Register A für Code 4"},null,null,"  ","  ","  ","  ","Register B",null,null,null,null,null,"  ","Dezimierte Folge","  ",null,"  ",null,"  ","  ",null,"  ",null,"  ",null,"  ","  "]
[null,"  ",null,null,null,"  ","  ","  ","  ",null,null,null,null,null,null,"  ",null,"  ",null,"  ",null,"  ","  ",null,"  ",null,"  "]
[null,1,1,0,0,"  ","  ","  ","  ",1,1,1,1,1,1,"  ",{"$f":"O6","v":1},null,0,"  ",1,"  ","  ",-0.14285714285714285,"  ",{"$f":"IF(X6=\"  \",\"  \",X6*63)","v":-9}]
[null,{"$f":"B6+1","v":2},0,1,0,"  ","  ","  ","  ",0,1,1,1,1,1,null,{"$f":"O15","v":0},null,1,"  ",1,"  ","  ",-0.14285714285714285,"  ",{"$f":"IF(X7=\"  \",\"  \",X7*63)","v":-9}]
[null,{"$f":"B7+1","v":3},1,0,1,"  ","  ","  ","  ",0,0,1,1,1,1,null,{"$f":"O24","v":0},null,0,"  ",0,"  ","  ",-1.5873015873015872E-2,"  ",-1]
[null,4,1,1,0,"  ","  ","  ","  ",1,0,0,1,1,1,null,{"$f":"O33","v":1},null,0,"  ",1,"  ","  ",0.1111111111111111,"  ",7]
[null,5,1,1,1,"  ","  ","  ","  ",0,1,0,0,1,1,null,{"$f":"O42","v":0},null,0,"  ",0,"  ","  ",0.1111111111111111,"  ",7]
[null,6,0,1,1,"  ","  ","  ","  ",1,0,1,0,0,1,null,{"$f":"O51","v":1},null,1,"  ",0,"  ","  ",0.1111111111111111,"  ",7]
[null,7,0,0,1,"  ","  ","  ","  ",0,1,0,1,0,0,null,{"$f":"O60","v":1},null,0,"  ",1,"  ","  ",-0.14285714285714285,"  ",-9]
[null,8,1,0,0,"  ","  ","  ","  ",1,0,1,0,1,0,null,null,null,1,"  ",0,"  ","  ",-0.14285714285714285,"  ",-9]
[null,9,0,1,0,"  ","  ","  ","  ",0,1,0,1,0,1,null,null,null,1,"  ",1,"  ","  ",-0.14285714285714285,"  ",-9]
[null,10,1,0,1,"  ","  ","  ","  ",0,0,1,0,1,0,null,null,null,1,"  ",1,"  ","  ",-1.5873015873015872E-2,"  ",-1,null,"  ","  ","  "]
[null,11,1,1,0,"  ","  ","  ","  ",0,0,0,1,0,1,null,null,null,0,"  ",1,"  ","  ",0.1111111111111111,"  ",7,null," ","  ","  "]
[null,12,1,1,1,"  ","  ","  ","  ",1,0,0,0,1,0,null,null,null,1,"  ",1,"  ","  ",0.1111111111111111,"  ",7,null,{"$f":"IF(Code!F1=\"XX\",\"  \",CONCATENATE(\"Die ''dezimierte Folge'' erscheint \",Code!F1,\" mal zyklisch vertauscht in den Registerzellen 3 von Register A\"))","v":"Die ''dezimierte Folge'' erscheint 6 mal zyklisch vertauscht in den Registerzellen 3 von Register A"}]
[null,13,0,1,1,"  ","  ","  ","  ",1,1,0,0,0,1,null,null,null,1,"  ",0,"  ","  ",0.1111111111111111,"  ",7]
[null,14,0,0,1,"  ","  ","  ","  ",0,1,1,0,0,0,null,null,null,0,"  ",1,"  ","  ",-0.14285714285714285,"  ",-9,null,"  ","  ","  "]
[null,15,1,0,0,"  ","  ","  ","  ",0,0,1,1,0,0,null,null,null,1,"  ",0,"  ","  ",-0.14285714285714285,"  ",-9,null,{"$f":"IF(Code!G1=\"XX\",\"  \",\"Spalte Z der Tabelle enthält die Produkte KKF*63 bzw. AKF*63. Sie enthält nur die bei einer Kasami-Folge der Länge N= 63 zu erwartenden Werte.\")","v":"Spalte Z der Tabelle enthält die Produkte KKF*63 bzw. AKF*63. Sie enthält nur die bei einer Kasami-Folge der Länge N= 63 zu erwartenden Werte."}]
[null,16,0,1,0,"  ","  ","  ","  ",1,0,0,1,1,0,null,null,null,0,"  ",0,"  ","  ",-0.14285714285714285,"  ",-9]
[null,17,1,0,1,"  ","  ","  ","  ",1,1,0,0,1,1,null,null,null,0,"  ",0,"  ","  ",-1.5873015873015872E-2,"  ",-1]
[null,18,1,1,0,"  ","  ","  ","  ",1,1,1,0,0,1,null,null,null,0,"  ",1,"  ","  ",0.1111111111111111,"  ",7]
[null,19,1,1,1,"  ","  ","  ","  ",1,1,1,1,0,0,null,null,null,1,"  ",1,"  ","  ",0.1111111111111111,"  ",7,null,"  ","  ","  "]
[null,20,0,1,1,"  ","  ","  ","  ",0,1,1,1,1,0,null,null,null,0,"  ",1,"  ","  ",-0.14285714285714285,"  ",-9,null,"  ","  ","  "]
[null,21,0,0,1,"  ","  ","  ","  ",1,0,1,1,1,1,null,null,null,1,"  ",0,"  ","  ",0.1111111111111111,"  ",7,null,"  ","  ","  "]
[null,22,1,0,0,"  ","  ","  ","  ",1,1,0,1,1,1,null,null,null,0,"  ",1,"  ","  ",0.1111111111111111,"  ",7,null,"  ","  ","  "]
[null,23,0,1,0,"  ","  ","  ","  ",1,1,1,0,1,1,null,null,null,1,"  ",1,"  ","  ",0.1111111111111111,"  ",7,null,"  ","  ","  "]
[null,24,1,0,1,"  ","  ","  ","  ",0,1,1,1,0,1,null,null,null,0,"  ",0,"  ","  ",-1.5873015873015872E-2,"  ",-1,null,"  ","  ","  "]
[null,25,1,1,0,"  ","  ","  ","  ",1,0,1,1,1,0,null,null,null,1,"  ",0,"  ","  ",0.1111111111111111,"  ",7,null,"  ","  ","  "]
[null,26,1,1,1,"  ","  ","  ","  ",0,1,0,1,1,1,null,null,null,0,"  ",0,"  ","  ",0.1111111111111111,"  ",7,null,"  ","  ","  "]
[null,27,0,1,1,"  ","  ","  ","  ",1,0,1,0,1,1,null,null,null,1,"  ",0,"  ","  ",-0.14285714285714285,"  ",-9,null,"  ","  ","  "]
[null,28,0,0,1,"  ","  ","  ","  ",1,1,0,1,0,1,null,null,null,1,"  ",0,"  ","  ",-0.14285714285714285,"  ",-9,null,"  ","  ","  "]
[null,29,1,0,0,"  ","  ","  ","  ",0,1,1,0,1,0,null,null,null,1,"  ",0,"  ","  ",-0.14285714285714285,"  ",-9,null,"  ","  ","  "]
[null,30,0,1,0,"  ","  ","  ","  ",1,0,1,1,0,1,null,null,null,1,"  ",1,"  ","  ",-0.14285714285714285,"  ",-9,null,"  ","  ","  "]
[null,31,1,0,1,"  ","  ","  ","  ",0,1,0,1,1,0,null,null,null,1,"  ",1,"  ","  ",-1.5873015873015872E-2,"  ",-1,null,"  ","  ","  "]
[null,32,1,1,0,"  ","  ","  ","  ",0,0,1,0,1,1,null,null,null,0,"  ",1,"  ","  ",-0.14285714285714285,"  ",-9,null,"  ","  ","  "]
[null,33,1,1,1,"  ","  ","  ","  ",1,0,0,1,0,1,null,null,null,0,"  ",0,"  ","  ",0.1111111111111111,"  ",7,null,"  ","  ","  "]
[null,34,0,1,1,"  ","  ","  ","  ",1,1,0,0,1,0,null,null,null,0,"  ",1,"  ","  ",0.1111111111111111,"  ",7,null,"  ","  ","  "]
[null,35,0,0,1,"  ","  ","  ","  ",0,1,1,0,0,1,null,null,null,1,"  ",0,"  ","  ",0.1111111111111111,"  ",7,null,"  ","  ","  "]
[null,36,1,0,0,"  ","  ","  ","  ",1,0,1,1,0,0,null,null,null,1,"  ",0,"  ","  ",-0.14285714285714285,"  ",-9,null,"  ","  ","  "]
[null,37,0,1,0,"  ","  ","  ","  ",1,1,0,1,1,0,null,null,null,0,"  ",0,"  ","  ",0.1111111111111111,"  ",7,null,"  ","  ","  "]
[null,38,1,0,1,"  ","  ","  ","  ",0,1,1,0,1,1,null,null,null,0,"  ",0,"  ","  ",-1.5873015873015872E-2,"  ",-1,null,"  ","  ","  "]
[null,39,1,1,0,"  ","  ","  ","  ",0,0,1,1,0,1,null,null,null,0,"  ",1,"  ","  ",0.1111111111111111,"  ",7,null,"  ","  ","  "]
[null,40,1,1,1,"  ","  ","  ","  ",0,0,0,1,1,0,null,null,null,1,"  ",1,"  ","  ",-0.14285714285714285,"  ",-9,null,"  ","  ","  "]
[null,41,0,1,1,"  ","  ","  ","  ",1,0,0,0,1,1,null,null,null,1,"  ",0,"  ","  ",0.1111111111111111,"  ",7,null,"  ","  ","  "]
[null,42,0,0,1,"  ","  ","  ","  ",0,1,0,0,0,1,null,null,null,1,"  ",0,"  ","  ",-0.14285714285714285,"  ",-9,null,"  ","  ","  "]
[null,43,1,0,0,"  ","  ","  ","  ",0,0,1,0,0,0,null,null,null,1,"  ",0,"  ","  ",0.1111111111111111,"  ",7,null,"  ","  ","  "]
[null,44,0,1,0,"  ","  ","  ","  ",1,0,0,1,0,0,null,null,null,0,"  ",0,"  ","  ",-0.14285714285714285,"  ",-9,null,"  ","  ","  "]
[null,45,1,0,1,"  ","  ","  ","  ",0,1,0,0,1,0,null,null,null,1,"  ",1,"  ","  ",-1.5873015873015872E-2,"  ",-1,null,"  ","  ","  "]
[null,46,1,1,0,"  ","  ","  ","  ",0,0,1,0,0,1,null,null,null,0,"  ",1,"  ","  ",-0.14285714285714285,"  ",-9,null,"  ","  ","  "]
[null,47,1,1,1,"  ","  ","  ","  ",0,0,0,1,0,0,null,null,null,1,"  ",1,"  ","  ",0.1111111111111111,"  ",7,null,"  ","  ","  "]
[null,48,0,1,1,"  ","  ","  ","  ",0,0,0,0,1,0,null,null,null,0,"  ",1,"  ","  ",-0.14285714285714285,"  ",-9,null,"  ","  ","  "]
[null,49,0,0,1,"  ","  ","  ","  ",1,0,0,0,0,1,null,null,null,1,"  ",0,"  ","  ",-0.14285714285714285,"  ",-9,null,"  ","  ","  "]
[null,50,1,0,0,"  ","  ","  ","  ",1,1,0,0,0,0,null,null,null,1,"  ",0,"  ","  ",-0.14285714285714285,"  ",-9,null,"  ","  ","  "]
[null,51,0,1,0,"  ","  ","  ","  ",1,1,1,0,0,0,null,null,null,0,"  ",0,"  ","  ",0.1111111111111111,"  ",7,null,"  ","  ","  "]
[null,52,1,0,1,"  ","  ","  ","  ",0,1,1,1,0,0,null,null,null,1,"  ",1,"  ","  ",-1.5873015873015872E-2,"  ",-1,null,"  ","  ","  "]
[null,53,1,1,0,"  ","  ","  ","  ",0,0,1,1,1,0,null,null,null,1,"  ",0,"  ","  ",0.1111111111111111,"  ",7,null,"  ","  ","  "]
[null,54,1,1,1,"  ","  ","  ","  ",0,0,0,1,1,1,null,null,null,0,"  ",0,"  ","  ",0.1111111111111111,"  ",7,null,"  ","  ","  "]
[null,55,0,1,1,"  ","  ","  ","  ",0,0,0,0,1,1,null,null,null,1,"  ",0,"  ","  ",0.1111111111111111,"  ",7,null,"  ","  ","  "]
{"$rows_left_out":15}
{"sheet":"IS","index":1,"n_rows":9,"n_cols":9,"rows_kept":9,"cut":false,"hidden":false,"merged":[]}
[]
[null,null,null,1,2,3]
[null,null,1,0,0,1,null,{"$f":"F3*2^0 + E3*2^1+D3*2^2","v":1}]
[null,null,2,0,1,0,null,2,"1 mal vertauscht"]
[null,null,3,0,1,1,null,3,"2 mal verauscht"]
[null,null,4,1,0,0,null,4,"3 mal verauscht"]
[null,null,5,1,0,1,null,{"$f":"F7*2^0 + E7*2^1+D7*2^2","v":5},"4 mal verauscht"]
[null,null,6,1,1,0,null,{"$f":"F8*2^0 + E8*2^1+D8*2^2","v":6},"5 mal verauscht"]
[null,null,7,1,1,1,null,7,"6 mal verauscht"]

{"sheet":"Code","index":2,"n_rows":74,"n_cols":33,"rows_kept":74,"cut":false,"hidden":false,"merged":[]}
[null,5,4,"  ",4,6,"YY","  ","  ","  ","  ","  ","  ","  ","  ","  ","  ","  ","  ","  ","  ","  ","  ","  ","  ","  ","  ","  ","  ","  ","  ","  ","  "]
[null,"  ","  ","  ",{"$f":"IF(E1=\"XX\",\"Register A  \",CONCATENATE(\"Register A für Code \",E1))","v":"Register A für Code 4"},"  ","  ","  ","  ","  ","  ","  ","  ","  ","  ","  ","  ","  ","  ","  ","  ","  ","  ","  ","  ","  ","  ","  ","  ","  ","  ","  ","  "]
[null,0,1,"  ",null,"  ","  ","  ","  ","  ","  ","  ","  ","  ","  ","  ","  ","  ","  ","  ","  ","  ","  ","  ","  ","  ","  ","  ","  ","  ","  ","  ","  "]
[null,1,1,"  ","  ","  ","  ","  ","  ","  ","  ","  ","  ","  ","  ","  ","  ","  ","  ","  ","  ","  ","  ","  ","  ","  ","  ","  ","  ","  ","  ","  ","  "]
[null,0,0,"  ","  ","  ","  ","  ","  ","  ","  ","  ","  ","  ","  ","  ","  ","  ","  ","  ","  ","  ","  ","  ","  ","  ","  ","  ","  ","  ","  ","  ","  "]
[null,0,1,"  ",{"$f":"CONCATENATE(\"Kasami-Code \", B1)","v":"Kasami-Code 5"},"  ","  ","  ","  ","  ","  ","  ","  ","  ","  ","  ","  ","  ","  ","  ","  ","  ","  ","  ","  ","  ","  ","  ","  ","  ","  ","  ","  "]
[null,0,0,"  ",{"$f":"CONCATENATE(\"Kasami-Code \",C1)","v":"Kasami-Code 4"},"  ","  ","  ","  ","  ","  ","  ","  ","  ","  ","  ","  ","  ","  ","  ","  ","  ","  ","  ","  ","  ","  ","  ","  ","  ","  ","  ","  "]
[null,1,0,"  ","  ","  ","  ","  ","  ","  ","  ","  ","  ","  ","  ","  ","  ","  ","  ","  ","  ","  ","  ","  ","  ","  ","  ","  ","  ","  ","  ","  ","  "]
[null,0,1,"  ","  ","  ","  ","  ","  ","  ","  ","  ","  ","  ","  ","  ","  ","  ","  ","  ","  ","  ","  ","  ","  ","  ","  ","  ","  ","  ","  ","  ","  "]
[null,1,0,"  ",{"$f":" IF(B1=E1,CONCATENATE(\"AKF Code \",B1),CONCATENATE(\"KKF Codes \",B1,\" / \", C1))","v":"KKF Codes 5 / 4"},"  ","  ","  ","  ","  ","  ","  ","  ","  ","  ","  ","  ","  ","  ","  ","  ","  ","  ","  ","  ","  ","  ","  ","  ","  ","  ","  ","  "]
[null,1,1,"  ","  ","  ","  ","  ","  ","  ","  ","  ","  ","  ","  ","  ","  ","  ","  ","  ","  ","  ","  ","  ","  ","  ","  ","  ","  ","  ","  ","  ","  "]
[null,1,1,"  ","  ","  ","  ","  ","  ","  ","  ","  ","  ","  ","  ","  ","  ","  ","  ","  ","  ","  ","  ","  ","  ","  ","  ","  ","  ","  ","  ","  ","  "]
[null,0,1,"  ","  ","  ","  ","  ","  ","  ","  ","  ","  ","  ","  ","  ","  ","  ","  ","  ","  ","  ","  ","  ","  ","  ","  ","  ","  ","  ","  ","  ","  "]
[null,1,1,"  ","  ","  ","  ","  ","  ","  ","  ","  ","  ","  ","  ","  ","  ","  ","  ","  ","  ","  ","  ","  ","  ","  ","  ","  ","  ","  ","  ","  ","  "]
[null,1,0,"  ","  ","  ","  ","  ","  ","  ","  ","  ","  ","  ","  ","  ","  ","  ","  ","  ","  ","  ","  ","  ","  ","  ","  ","  ","  ","  ","  ","  ","  "]
[null,0,1,"  ","  ","  ","  ","  ","  ","  ","  ","  ","  ","  ","  ","  ","  ","  ","  ","  ","  ","  ","  ","  ","  ","  ","  ","  ","  ","  ","  ","  ","  "]
[null,1,0,"  ","  ","  ","  ","  ","  ","  ","  ","  ","  ","  ","  ","  ","  ","  ","  ","  ","  ","  ","  ","  ","  ","  ","  ","  ","  ","  ","  ","  ","  "]
[null,0,0,"  ","  ","  ","  ","  ","  ","  ","  ","  ","  ","  ","  ","  ","  ","  ","  ","  ","  ","  ","  ","  ","  ","  ","  ","  ","  ","  ","  ","  ","  "]
[null,0,0,"  ","  ","  ","  ","  ","  ","  ","  ","  ","  ","  ","  ","  ","  ","  ","  ","  ","  ","  ","  ","  ","  ","  ","  ","  ","  ","  ","  ","  ","  "]
[null,0,1,"  ","  ","  ","  ","  ","  ","  ","  ","  ","  ","  ","  ","  ","  ","  ","  ","  ","  ","  ","  ","  ","  ","  ","  ","  ","  ","  ","  ","  ","  "]
[null,1,1,"  ","  ","  ","  ","  ","  ","  ","  ","  ","  ","  ","  ","  ","  ","  ","  ","  ","  ","  ","  ","  ","  ","  ","  ","  ","  ","  ","  ","  ","  "]
[null,0,1,"  ","  ","  ","  ","  ","  ","  ","  ","  ","  ","  ","  ","  ","  ","  ","  ","  ","  ","  ","  ","  ","  ","  ","  ","  ","  ","  ","  ","  ","  "]
[null,1,0,"  ","  ","  ","  ","  ","  ","  ","  ","  ","  ","  ","  ","  ","  ","  ","  ","  ","  ","  ","  ","  ","  ","  ","  ","  ","  ","  ","  ","  ","  "]
[null,0,1,"  ","  ","  ","  ","  ","  ","  ","  ","  ","  ","  ","  ","  ","  ","  ","  ","  ","  ","  ","  ","  ","  ","  ","  ","  ","  ","  ","  ","  ","  "]
[null,1,1,"  ","  ","  ","  ","  ","  ","  ","  ","  ","  ","  ","  ","  ","  ","  ","  ","  ","  ","  ","  ","  ","  ","  ","  ","  ","  ","  ","  ","  ","  "]
[null,0,0,"  ","  ","  ","  ","  ","  ","  ","  ","  ","  ","  ","  ","  ","  ","  ","  ","  ","  ","  ","  ","  ","  ","  ","  ","  ","  ","  ","  ","  ","  "]
[null,1,0,"  ","  ","  ","  ","  ","  ","  ","  ","  ","  ","  ","  ","  ","  ","  ","  ","  ","  ","  ","  ","  ","  ","  ","  ","  ","  ","  ","  ","  ","  "]
[null,0,0,"  ","  ","  ","  ","  ","  ","  ","  ","  ","  ","  ","  ","  ","  ","  ","  ","  ","  ","  ","  ","  ","  ","  ","  ","  ","  ","  ","  ","  ","  "]
[null,1,0,"  ","  ","  ","  ","  ","  ","  ","  ","  ","  ","  ","  ","  ","  ","  ","  ","  ","  ","  ","  ","  ","  ","  ","  ","  ","  ","  ","  ","  ","  "]
[null,1,0,"  ","  ","  ","  ","  ","  ","  ","  ","  ","  ","  ","  ","  ","  ","  ","  ","  ","  ","  ","  ","  ","  ","  ","  ","  ","  ","  ","  ","  ","  "]
[null,1,0,"  ","  ","  ","  ","  ","  ","  ","  ","  ","  ","  ","  ","  ","  ","  ","  ","  ","  ","  ","  ","  ","  ","  ","  ","  ","  ","  ","  ","  ","  "]
[null,1,1,"  ","  ","  ","  ","  ","  ","  ","  ","  ","  ","  ","  ","  ","  ","  ","  ","  ","  ","  ","  ","  ","  ","  ","  ","  ","  ","  ","  ","  ","  "]
[null,1,1,"  ","  ","  ","  ","  ","  ","  ","  ","  ","  ","  ","  ","  ","  ","  ","  ","  ","  ","  ","  ","  ","  ","  ","  ","  ","  ","  ","  ","  ","  "]
[null,0,1,"  ","  ","  ","  ","  ","  ","  ","  ","  ","  ","  ","  ","  ","  ","  ","  ","  ","  ","  ","  ","  ","  ","  ","  ","  ","  ","  ","  ","  ","  "]
[null,0,0,"  ","  ","  ","  ","  ","  ","  ","  ","  ","  ","  ","  ","  ","  ","  ","  ","  ","  ","  ","  ","  ","  ","  ","  ","  ","  ","  ","  ","  ","  "]
[null,0,1,"  ","  ","  ","  ","  ","  ","  ","  ","  ","  ","  ","  ","  ","  ","  ","  ","  ","  ","  ","  ","  ","  ","  ","  ","  ","  ","  ","  ","  ","  "]
[null,1,0,"  ","  ","  ","  ","  ","  ","  ","  ","  ","  ","  ","  ","  ","  ","  ","  ","  ","  ","  ","  ","  ","  ","  ","  ","  ","  ","  ","  ","  ","  "]
[null,1,0,"  ","  ","  ","  ","  ","  ","  ","  ","  ","  ","  ","  ","  ","  ","  ","  ","  ","  ","  ","  ","  ","  ","  ","  ","  ","  ","  ","  ","  ","  "]
[null,0,0,"  ","  ","  ","  ","  ","  ","  ","  ","  ","  ","  ","  ","  ","  ","  ","  ","  ","  ","  ","  ","  ","  ","  ","  ","  ","  ","  ","  ","  ","  "]
[null,0,0,"  ","  ","  ","  ","  ","  ","  ","  ","  ","  ","  ","  ","  ","  ","  ","  ","  ","  ","  ","  ","  ","  ","  ","  ","  ","  ","  ","  ","  ","  "]
[null,0,1,"  ","  ","  ","  ","  ","  ","  ","  ","  ","  ","  ","  ","  ","  ","  ","  ","  ","  ","  ","  ","  ","  ","  ","  ","  ","  ","  ","  ","  ","  "]
[null,1,1,"  ","  ","  ","  ","  ","  ","  ","  ","  ","  ","  ","  ","  ","  ","  ","  ","  ","  ","  ","  ","  ","  ","  ","  ","  ","  ","  ","  ","  ","  "]
[null,1,0,"  ","  ","  ","  ","  ","  ","  ","  ","  ","  ","  ","  ","  ","  ","  ","  ","  ","  ","  ","  ","  ","  ","  ","  ","  ","  ","  ","  ","  ","  "]
[null,1,0,"  ","  ","  ","  ","  ","  ","  ","  ","  ","  ","  ","  ","  ","  ","  ","  ","  ","  ","  ","  ","  ","  ","  ","  ","  ","  ","  ","  ","  ","  "]
[null,1,0,"  ","  ","  ","  ","  ","  ","  ","  ","  ","  ","  ","  ","  ","  ","  ","  ","  ","  ","  ","  ","  ","  ","  ","  ","  ","  ","  ","  ","  ","  "]
[null,0,0,"  ","  ","  ","  ","  ","  ","  ","  ","  ","  ","  ","  ","  ","  ","  ","  ","  ","  ","  ","  ","  ","  ","  ","  ","  ","  ","  ","  ","  ","  "]
[null,1,1,"  ","  ","  ","  ","  ","  ","  ","  ","  ","  ","  ","  ","  ","  ","  ","  ","  ","  ","  ","  ","  ","  ","  ","  ","  ","  ","  ","  ","  ","  "]
[null,0,1,"  ","  ","  ","  ","  ","  ","  ","  ","  ","  ","  ","  ","  ","  ","  ","  ","  ","  ","  ","  ","  ","  ","  ","  ","  ","  ","  ","  ","  ","  "]
[null,1,1,"  ","  ","  ","  ","  ","  ","  ","  ","  ","  ","  ","  ","  ","  ","  ","  ","  ","  ","  ","  ","  ","  ","  ","  ","  ","  ","  ","  ","  ","  "]
[null,0,1,"  ","  ","  ","  ","  ","  ","  ","  ","  ","  ","  ","  ","  ","  ","  ","  ","  ","  ","  ","  ","  ","  ","  ","  ","  ","  ","  ","  ","  ","  "]
[null,1,0,"  ","  ","  ","  ","  ","  ","  ","  ","  ","  ","  ","  ","  ","  ","  ","  ","  ","  ","  ","  ","  ","  ","  ","  ","  ","  ","  ","  ","  ","  "]
[null,1,0,"  ","  ","  ","  ","  ","  ","  ","  ","  ","  ","  ","  ","  ","  ","  ","  ","  ","  ","  ","  ","  ","  ","  ","  ","  ","  ","  ","  ","  ","  "]
[null,0,0,"  ","  ","  ","  ","  ","  ","  ","  ","  ","  ","  ","  ","  ","  ","  ","  ","  ","  ","  ","  ","  ","  ","  ","  ","  ","  ","  ","  ","  ","  "]
[null,1,1,"  ","  ","  ","  ","  ","  ","  ","  ","  ","  ","  ","  ","  ","  ","  ","  ","  ","  ","  ","  ","  ","  ","  ","  ","  ","  ","  ","  ","  ","  "]
[null,1,0,"  ","  ","  ","  ","  ","  ","  ","  ","  ","  ","  ","  ","  ","  ","  ","  ","  ","  ","  ","  ","  ","  ","  ","  ","  ","  ","  ","  ","  ","  "]
[null,0,0,"  ","  ","  ","  ","  ","  ","  ","  ","  ","  ","  ","  ","  ","  ","  ","  ","  ","  ","  ","  ","  ","  ","  ","  ","  ","  ","  ","  ","  ","  "]
[null,1,0,"  ","  ","  ","  ","  ","  ","  ","  ","  ","  ","  ","  ","  ","  ","  ","  ","  ","  ","  ","  ","  ","  ","  ","  ","  ","  ","  ","  ","  ","  "]
[null,1,0,"  ","  ","  ","  ","  ","  ","  ","  ","  ","  ","  ","  ","  ","  ","  ","  ","  ","  ","  ","  ","  ","  ","  ","  ","  ","  ","  ","  ","  ","  "]
[null,1,0,"  ","  ","  ","  ","  ","  ","  ","  ","  ","  ","  ","  ","  ","  ","  ","  ","  ","  ","  ","  ","  ","  ","  ","  ","  ","  ","  ","  ","  ","  "]
[null,0,0,"  ","  ","  ","  ","  ","  ","  ","  ","  ","  ","  ","  ","  ","  ","  ","  ","  ","  ","  ","  ","  ","  ","  ","  ","  ","  ","  ","  ","  ","  "]
{"$rows_left_out":15}
{"sheet":"Graphik","index":3,"n_rows":80,"n_cols":9,"rows_kept":80,"cut":false,"hidden":false,"merged":[]}
[null,null,null,null,0,0,null,0,1]
[null,null,null,null,1,0,null,1,1]
[null,"AKF",null,null,1,1,null,2,1]
[-21,0.1111111111111111,null,null,2,1,null,2,0]
[{"$f":"A4+1","v":-20},-0.14285714285714285,null,null,2,0,null,3,0]
[{"$f":"A5+1","v":-19},-1.5873015873015872E-2,null,null,3,0,null,3,1]
[-18,-0.14285714285714285,null,null,4,0,null,4,1]
[-17,0.1111111111111111,null,null,5,0,null,4,0]
[-16,-0.14285714285714285,null,null,5,1,null,5,0]
[-15,-0.14285714285714285,null,null,6,1,null,6,0]
[-14,-0.14285714285714285,null,null,6,0,null,6,1]
[-13,0.1111111111111111,null,null,7,0,null,7,1]
[-12,-1.5873015873015872E-2,null,null,7,1,null,7,0]
[-11,0.1111111111111111,null,null,8,1,null,8,0]
[-10,0.1111111111111111,null,null,9,1,null,8,1]
[-9,0.1111111111111111,null,null,10,1,null,9,1]
[-8,0.1111111111111111,null,null,10,0,null,10,1]
[-7,-0.14285714285714285,null,null,11,0,null,11,1]
[-6,-0.14285714285714285,null,null,11,1,null,12,1]
[-5,-1.5873015873015872E-2,null,null,12,1,null,12,0]
[-4,-0.14285714285714285,null,null,13,1,null,13,0]
[-3,-0.14285714285714285,null,null,13,0,null,13,1]
[-2,-0.14285714285714285,null,null,14,0,null,14,1]
[-1,0.1111111111111111,null,null,14,1,null,14,0]
[0,-0.14285714285714285,null,null,15,1,null,15,0]
[1,-0.14285714285714285,null,null,15,0,null,16,0]
[2,-1.5873015873015872E-2,null,null,16,0,null,17,0]
[3,0.1111111111111111,null,null,17,0,null,17,1]
[4,0.1111111111111111,null,null,18,0,null,18,1]
[5,0.1111111111111111,null,null,18,1,null,19,1]
[6,-0.14285714285714285,null,null,19,1,null,20,1]
[7,-0.14285714285714285,null,null,19,0,null,20,0]
[8,-0.14285714285714285,null,null,20,0,null,21,0]
[9,-1.5873015873015872E-2,null,null,20,1,null,21,1]
[10,0.1111111111111111,null,null,21,1,null,22,1]
[11,0.1111111111111111,null,null,21,0,null,23,1]
[12,0.1111111111111111,null,null,22,0,null,23,0]
[13,-0.14285714285714285,null,null,22,1,null,24,0]
[14,-0.14285714285714285,null,null,23,1,null,25,0]
[15,-0.14285714285714285,null,null,23,0,null,26,0]
[16,-1.5873015873015872E-2,null,null,24,0,null,27,0]
[17,0.1111111111111111,null,null,24,1,null,28,0]
[18,0.1111111111111111,null,null,25,1,null,29,0]
[19,-0.14285714285714285,null,null,25,0,null,29,1]
[20,0.1111111111111111,null,null,26,0,null,30,1]
[21,0.1111111111111111,null,null,26,1,null,31,1]
[null,null,null,null,27,1,null,32,1]
[null,null,null,null,28,1,null,32,0]
[null,null,null,null,29,1,null,33,0]
[null,null,null,null,30,1,null,33,1]
[null,null,null,null,31,1,null,34,1]
[null,null,null,null,31,0,null,34,0]
[null,null,null,null,32,0,null,35,0]
[null,null,null,null,33,0,null,36,0]
[null,null,null,null,34,0,null,37,0]
[null,null,null,null,34,1,null,38,0]
[null,null,null,null,35,1,null,38,1]
[null,null,null,null,36,1,null,39,1]
[null,null,null,null,36,0,null,40,1]
[null,null,null,null,37,0,null,40,0]
{"$rows_left_out":20}